{"text_format":"1","workbook":"xlsx","n_sheets":5,"sheets":["Liquidacion","Cuenta de Cobro","TARIFAS","BASES CUENTA","Control de Cambios"],"not_rendered":{"charts":0,"images":1,"macros":1,"external_links":1,"defined_names":18,"comments":1,"pivot_tables":0},"unopened":[],"bounds":{"document_bytes":16777216,"sheet_cells":100000,"rows_first":2000,"rows_last":500,"rows_between":2000,"halvings":0,"cell_chars":16384,"cell_head_chars":4096},"cells_cut":0,"cells_raw":0,"read":"whole","date_system":"1900"}

{"sheet":"Liquidacion","index":0,"n_rows":119,"n_cols":24,"rows_kept":119,"cut":false,"hidden":false,"merged":[[107,1,107,5],[108,1,108,5],[109,1,109,5],[110,1,110,5],[111,1,111,5],[103,1,103,5],[103,11,103,13],[104,1,104,5],[105,1,105,5],[106,1,106,5],[99,1,99,5],[99,14,99,19],[100,1,100,5],[101,1,101,5],[102,1,102,5],[96,1,96,5],[96,14,96,19],[97,1,97,5],[97,14,97,19],[98,1,98,5],[98,14,98,19],[93,1,93,5],[93,14,93,19],[94,1,94,5],[94,14,94,19],[95,1,95,5],[95,14,95,19],[90,11,90,19],[91,1,91,5],[91,11,91,12],[91,13,92,13],[91,14,92,19],[92,1,92,5],[83,1,83,8],[84,1,85,9],[86,1,86,9],[88,1,88,8],[90,1,90,5],[78,1,78,6],[79,1,79,6],[81,1,81,6],[82,1,82,6],[80,1,80,6],[75,1,75,5],[75,6,75,9],[76,1,76,9],[77,1,77,6],[77,19,77,20],[73,1,73,5],[73,6,73,9],[73,19,73,21],[74,1,74,5],[74,6,74,9],[71,1,71,5],[71,6,71,9],[72,1,72,5],[72,6,72,9],[72,19,72,21],[67,1,67,9],[68,1,68,5],[68,6,68,9],[69,1,69,9],[70,1,70,9],[0,1,0,9],[15,1,15,9],[17,1,17,9],[3,2,3,3],[6,1,6,9],[16,6,16,9],[12,8,12,9],[10,8,10,9],[8,8,8,9],[16,1,16,5],[18,1,18,9],[19,1,19,5],[20,1,20,5],[21,1,21,5],[19,6,19,9],[20,6,20,9],[21,6,21,9],[33,1,33,9],[24,1,24,9],[26,1,26,6],[27,1,27,6],[28,1,28,6],[29,1,29,6],[30,1,30,8],[25,1,25,6],[20,19,20,21],[21,19,21,21],[25,19,25,20],[22,1,22,5],[31,1,32,9],[23,1,23,5],[22,6,22,9],[23,6,23,9],[50,11,50,13],[37,11,37,19],[38,14,39,19],[40,14,40,19],[41,14,41,19],[42,14,42,19],[43,14,43,19],[44,14,44,19],[45,14,45,19],[46,14,46,19],[38,11,38,12],[38,13,39,13],[41,1,41,5],[42,1,42,5],[43,1,43,5],[44,1,44,5],[45,1,45,5],[35,1,35,8],[37,1,37,5],[38,1,38,5],[39,1,39,5],[40,1,40,5],[56,1,56,5],[57,1,57,5],[58,1,58,5],[50,1,50,5],[51,1,51,5],[52,1,52,5],[53,1,53,5],[54,1,54,5],[46,1,46,5],[47,1,47,5],[48,1,48,5],[49,1,49,5],[55,1,55,5]]}
[null,"CIUDAD DE EJECUCION DEL CONTRATO",null,null,null,null,null,null,null,null,"CIUDAD DE EJECUCION"]
[]
[]
[null,"Ciudad Ejecución","BOGOTA, D.C."]
[]
[]
[null,"CERTIFICACIÓN DE CONDICIÓN DE DECLARANTE - Ley 1819 de 2016 "]
[]
[null,"Aportes Obligatorios de ARL? (*)",null,"SI","Pagos por intereses de vivienda? (*)",null,null,"NO",0]
[]
[null,"Declarante de renta por el año 2018?",null,"SI","Pagos a Medicina Prepagada /Seguros de Salud? (*)",null,null,"SI",0]
[]
[null,"Dependientes? (*)",null,"SI","Aportes Voluntarios a Fondos de Pensiones/AFC? (*)",null,null,"NO",0]
[]
[]
[null,"LIQUIDACION HONORARIOS NOVIEMBRE (Pago 1)"]
[null,"HONORARIOS NOVIEMBRE",null,null,null,null,4300000,null,null,null,null,null,null,null,{"$f":"UPPER(CONVERTIRNUM(G17))","v":"CUATRO MILLONES TRESCIENTOS MIL PESOS"}]
[]
[null,"LIQUIDACIÓN DE PAGO A SEGURIDAD SOCIAL - APORTES MES ANTERIOR"]
[null,"IBC OCTUBRE",null,null,null,null,{"$f":"+G17*0.4","v":1720000}]
[null,"Aporte obligatorio a seguridad social salud  mes Anterior",null,null,null,null,{"$f":"ROUND(+G20*12.5%,-2)","v":215000}]
[null,"Aporte obligatorio a seguridad social Pensión  Mes Anterior",null,null,null,null,{"$f":"ROUND(+G20*0.16,-2)","v":275200}]
[null,"Aporte obligatorio a Fondo de solidaridad Pensional Mes Anterior",null,null,null,null,{"$f":"ROUND(IF(G20>smlv*4,Liquidacion!G20*1%,0),-2)","v":0}]
[null,"ARL  Riesgos    Mes Anterior",null,null,null,null,{"$f":"IF(D9=\"SI\",ROUND(G20*0.522%,-2),)","v":9000}]
[]
[null,"NETO A PAGAR NOVIEMBRE",null,null,null,null,null,"BASE","%","VALOR",null,null,null,null,null,null,null,null,null,null,null,null,null,"Cálculo en $  retención "]
[null,{"$f":"+B17","v":"HONORARIOS NOVIEMBRE"},null,null,null,null,null,null,null,{"$f":"+G17","v":4300000},null,null,null,null,null,null,null,null,null,null,null,null,null,{"$f":"IF($Q$30>87,(IF($Q$30<=145,((($Q$30-87)*19%)*$W$22),0)),0)","v":0}]
[null,"- Retención en la fuente",null,null,null,null,null,{"$f":"+H58","v":2528100},{"$f":"-IFERROR(+J28/H28,0)","v":0},{"$f":"-N53","v":0},null,null,null,null,null,null,null,null,null,null,null,null,null,{"$f":"IF($Q$30>145,(IF($Q$30<=335,(((($Q$30-145)*28%)+11)*$W$22),0)),0)","v":0}]
[null,"- Retención de industria y comercio",null,null,null,null,null,{"$f":"+G17-(G21+G22+G23+G24)","v":3800800},{"$f":"IFERROR(VLOOKUP($C$4,TARIFAS!$B$3:$D$49,3,FALSE),0)","v":9.6600000000000002E-3},{"$f":"-H29*I29","v":-36715.728000000003},null,null,null,null,null,null,null,null,null,null,null,null,null,{"$f":"IF($Q$30>335,(IF($Q$30<=640,(((($Q$30-335)*33%)+64)*$W$22),0)),0)","v":0}]
[null,"- Deducción por abono en cuenta AFC",null,null,null,null,null,null,null,{"$f":"+I13","v":0},null,null,null,null,null,null,null,null,null,null,null,null,null,{"$f":"IF($Q$30>945,(IF($Q$30<=2300,(((($Q$30-945)*37%)+272)*$W$22),0)),0)","v":0}]
[null,"Neto a pagar  NOVIEMBRE(*)",null,null,null,null,null,null,null,{"$f":"SUM(J27:J30)","v":4263284.2719999999},null,null,null,null,null,null,null,null,null,null,null,null,null,{"$f":"IF($Q$30>2300,(((($Q$30-2300)*39%)*$W$22)+(773*$Q$28)),0)","v":0}]
[null,"(*) Las deducciones mencionadas, corresponden a valores sugeridos, los mismos, pueden cambiar conforme a las actualizaciones tributarias municipales y nacionales o por error en los valores deducibles"]
[]
[]
[]
[null,"TABLA DE HONORARIOS"]
[]
[null,"HONORARIOS",null,null,null,null,{"$f":"+G17","v":4300000},0.4,null,null,null,"Art. 383 del ET (Art. 23 ley 1111 de 2006)"]
[null,"BASE SEGURIDAD SOCIAL",null,null,null,null,{"$f":"+G20","v":1720000},null,null,null,{"$f":"+E61*4","v":3312464},"Rangos en  UVT",null,"Tarifa marginal","Impuesto"]
[null,"INGRESOS NO CONSTITUTIVOS DE RENTA NI GANANCIA OCASIONAL",null,null,null,null,null,null,null,null,null,"Desde","Hasta"]
{"$rows_left_out":80}
{"sheet":"Cuenta de Cobro","index":1,"n_rows":40,"n_cols":11,"rows_kept":40,"cut":false,"hidden":true,"merged":[[0,0,3,0],[4,0,5,10],[9,0,9,10],[0,1,1,8],[2,1,2,8],[3,1,3,8],[6,0,6,10],[7,0,7,10],[8,0,8,10],[34,1,34,5],[36,1,36,5],[24,1,26,10],[28,8,28,10],[30,1,30,5],[32,1,32,5],[28,1,28,5],[10,1,10,10],[14,0,14,10],[15,0,16,0],[24,0,26,0],[22,4,22,7],[12,1,12,5],[12,8,12,10],[11,0,11,10],[13,0,13,10],[22,1,22,3],[22,8,22,9],[15,1,16,10],[20,0,20,10],[18,1,18,10]]}
[null,"FORMATO CUENTA DE COBRO PARA PAGO DE CONTRATOS POR CONCEPTO DE HONORARIOS Y/O PRESTACIÓN DE SERVICIOS PERSONALES",null,null,null,null,null,null,null,"Código","710,14,15-7"]
[null,null,null,null,null,null,null,null,null,"Versión",1]
[null,"PROCEDIMIENTO DE PAGOS ",null,null,null,null,null,null,null,"Fecha","2019-03-22"]
[null,"GESTION FINANCIERA",null,null,null,null,null,null,null,"Pagina",1]
["CUENTA DE COBRO"]
[]
["LA UNIDAD DE ATENCION Y REPARACION INTEGRAL A VICTIMAS  "]
["NIT.   900.490.473 - 6"]
[]
["DEBE A:"]
["     NOMBRE:",{"$f":"+Liquidacion!#REF!","v":{"$error":"#REF!"}}]
[]
["     ID CEDULA :",{"$f":"+Liquidacion!#REF!","v":{"$error":"#REF!"}},null,null,null,null,null,"DE ","CIUDAD DE EXPEDICIÓN"]
[]
["LA SUMA DE:"]
["     (VALOR EN  LETRAS)",{"$f":"+Liquidacion!#REF!","v":{"$error":"#REF!"}}]
[]
[]
["     (VALOR NUMEROS) ",{"$f":"+Liquidacion!G17","v":4300000}]
[]
["POR CONCEPTO DE: "]
[]
["     CONTRATO No.",{"$f":"+Liquidacion!#REF!","v":{"$error":"#REF!"}},null,null,"REGISTRO PRESUPUESTAL",null,null,null,{"$f":"+Liquidacion!#REF!","v":{"$error":"#REF!"}}]
[]
["     OBJETO DEL CONTRATO: ","Enunciar objeto del contrato"]
[]
[]
[]
["     PERIODO COMPRENDIDO ENTRE:",{"$f":"+Liquidacion!#REF!","v":{"$error":"#REF!"}},null,null,null,null,"y",null,{"$f":"+Liquidacion!#REF!","v":{"$error":"#REF!"}}]
[]
["     FECHA:","Fecha"]
[]
["     CIUDAD EJECUCION CONTRATO",{"$f":"IF(Liquidacion!C4=\"otro\",Liquidacion!G4,Liquidacion!C4)","v":"BOGOTA, D.C."}]
[]
["     TELÉFONO","Telefono personal de contacto"]
[]
["     CORREO ELECTRONICO",{"$f":"+Liquidacion!#REF!","v":{"$error":"#REF!"}}]
[]
[]
["     FIRMA"]
{"$rows_left_out":1}
{"sheet":"TARIFAS","index":2,"n_rows":1033,"n_cols":10,"rows_kept":1033,"cut":false,"hidden":true,"merged":[]}
[null,"Ciudad","REGIMEN","TARIFA","TARIFA X 1000"]
[null,"Seleccionar",null,null,null,null,null,{"$f":"IFERROR(INDEX($B$2:$B$99, MATCH(0, INDEX(COUNTIF($H$1:H1, $B$2:$B$99), 0, 0), 0)),\"\")","v":"Seleccionar"},null,"ARMENIA"]
[{"$f":"B3&C3","v":"ARMENIAResponsable del Impuesto a las Ventas"},"ARMENIA","Responsable del Impuesto a las Ventas",{"$f":"+E3/1000","v":5.0000000000000001E-3},5,null,null,"ABEJORRAL",null,"BARRANCABERMEJA"]
[{"$f":"B4&C4","v":"ARMENIANo responsable del impuesto a las ventas"},"ARMENIA","No responsable del impuesto a las ventas",{"$f":"+E4/1000","v":5.0000000000000001E-3},5,null,null,"ABREGO",null,"BARRANQUILLA"]
["BARRANCABERMEJAResponsable del Impuesto a las Ventas","BARRANCABERMEJA","Responsable del Impuesto a las Ventas",6.0000000000000001E-3,6,null,null,"ABRIAQUI",null,"BOGOTA, D.C."]
["BARRANCABERMEJANo responsable del impuesto a las ventas","BARRANCABERMEJA","No responsable del impuesto a las ventas",6.0000000000000001E-3,6,null,null,"ACACIAS",null,"BUCARAMANGA"]
["BARRANQUILLAResponsable del Impuesto a las Ventas","BARRANQUILLA","Responsable del Impuesto a las Ventas",7.0000000000000001E-3,7,null,null,"ACANDI",null,"BUENAVENTURA"]
["BARRANQUILLANo responsable del impuesto a las ventas","BARRANQUILLA","No responsable del impuesto a las ventas",7.0000000000000001E-3,7,null,null,"ACEVEDO",null,"CALI"]
["BOGOTA, D.C.No responsable del impuesto a las ventas","BOGOTA, D.C.","No responsable del impuesto a las ventas",9.6600000000000002E-3,9.66,null,null,"AGRADO",null,"CUCUTA"]
["BUCARAMANGAResponsable del Impuesto a las Ventas","BUCARAMANGA","Responsable del Impuesto a las Ventas",5.0000000000000001E-3,5,null,null,"AGUA DE DIOS",null,"GRANADA"]
["BUCARAMANGANo responsable del impuesto a las ventas","BUCARAMANGA","No responsable del impuesto a las ventas",0,0,null,null,"AGUACHICA",null,"IBAGUE"]
["BUENAVENTURAResponsable del Impuesto a las Ventas","BUENAVENTURA","Responsable del Impuesto a las Ventas",0,0,null,null,"AGUADA",null,"LETICIA"]
["BUENAVENTURANo responsable del impuesto a las ventas","BUENAVENTURA","No responsable del impuesto a las ventas",0,0,null,null,"AGUADAS",null,"MEDELLIN"]
["CALIResponsable del Impuesto a las Ventas","CALI","Responsable del Impuesto a las Ventas",0.01,10,null,null,"AGUAZUL",null,"MOCOA"]
["CALINo responsable del impuesto a las ventas","CALI","No responsable del impuesto a las ventas",0,0,null,null,"AGUSTIN CODAZZI",null,"NEIVA"]
["CARTAGENAResponsable del Impuesto a las Ventas","CARTAGENA","Responsable del Impuesto a las Ventas",8.0000000000000002E-3,8,null,null,"AIPE",null,"PASTO"]
["CARTAGENANo responsable del impuesto a las ventas","CARTAGENA","No responsable del impuesto a las ventas",8.0000000000000002E-3,8,null,null,"ALBAN",null,"PEREIRA"]
["CUCUTAResponsable del Impuesto a las Ventas","CUCUTA","Responsable del Impuesto a las Ventas",5.7999999999999996E-3,5.8,null,null,"ALBANIA",null,"POPAYAN"]
["CUCUTANo responsable del impuesto a las ventas","CUCUTA","No responsable del impuesto a las ventas",5.7999999999999996E-3,5.8,null,null,"ALCALA",null,"QUIBDO"]
["GRANADAResponsable del Impuesto a las Ventas","GRANADA","Responsable del Impuesto a las Ventas",0,null,null,null,"ALDANA",null,"SAN JOSE DEL GUAVIARE"]
["GRANADANo responsable del impuesto a las ventas","GRANADA","No responsable del impuesto a las ventas",0,null,null,null,"ALEJANDRIA",null,"TUNJA"]
["IBAGUEResponsable del Impuesto a las Ventas","IBAGUE","Responsable del Impuesto a las Ventas",3.5000000000000001E-3,3.5,null,null,"ALGARROBO",null,"VALLEDUPAR"]
["IBAGUENo responsable del impuesto a las ventas","IBAGUE","No responsable del impuesto a las ventas",3.5000000000000001E-3,3.5,null,null,"ALGECIRAS",null,"VILLAVICENCIO"]
["LETICIAResponsable del Impuesto a las Ventas","LETICIA","Responsable del Impuesto a las Ventas",0,null,null,null,"ALMAGUER",null,"YOPAL"]
["LETICIANo responsable del impuesto a las ventas","LETICIA","No responsable del impuesto a las ventas",0,null,null,null,"ALMEIDA"]
["MEDELLINResponsable del Impuesto a las Ventas","MEDELLIN","Responsable del Impuesto a las Ventas",2E-3,2,null,null,"ALPUJARRA"]
["MEDELLINNo responsable del impuesto a las ventas","MEDELLIN","No responsable del impuesto a las ventas",0,0,null,null,"ALTAMIRA"]
["MOCOAResponsable del Impuesto a las Ventas","MOCOA","Responsable del Impuesto a las Ventas",0.01,10,null,null,"ALTO BAUDO"]
["MOCOANo responsable del impuesto a las ventas","MOCOA","No responsable del impuesto a las ventas",0.01,10,null,null,"ALTOS DEL ROSARIO"]
["NEIVAResponsable del Impuesto a las Ventas","NEIVA","Responsable del Impuesto a las Ventas",5.0000000000000001E-3,5,null,null,"ALVARADO"]
["NEIVANo responsable del impuesto a las ventas","NEIVA","No responsable del impuesto a las ventas",3.5000000000000001E-3,3.5,null,null,"AMAGA"]
[{"$f":"B32&C32","v":"PASTOResponsable del Impuesto a las Ventas"},"PASTO","Responsable del Impuesto a las Ventas",5.0000000000000001E-3,5,null,null,"AMALFI"]
["PASTONo responsable del impuesto a las ventas","PASTO","No responsable del impuesto a las ventas",5.0000000000000001E-3,5,null,null,"AMBALEMA"]
["PEREIRAResponsable del Impuesto a las Ventas","PEREIRA","Responsable del Impuesto a las Ventas",2E-3,2,null,null,"ANAPOIMA"]
["PEREIRANo responsable del impuesto a las ventas","PEREIRA","No responsable del impuesto a las ventas",2E-3,2,null,null,"ANCUYA"]
["POPAYANResponsable del Impuesto a las Ventas","POPAYAN","Responsable del Impuesto a las Ventas",6.0000000000000001E-3,6,null,null,"ANDALUCIA"]
["POPAYANNo responsable del impuesto a las ventas","POPAYAN","No responsable del impuesto a las ventas",6.0000000000000001E-3,6,null,null,"ANDES"]
["QUIBDOResponsable del Impuesto a las Ventas","QUIBDO","Responsable del Impuesto a las Ventas",2E-3,2,null,null,"ANGELOPOLIS"]
["QUIBDONo responsable del impuesto a las ventas","QUIBDO","No responsable del impuesto a las ventas",2E-3,2,null,null,"ANGOSTURA"]
["SAN JOSE DEL GUAVIAREResponsable del Impuesto a las Ventas","SAN JOSE DEL GUAVIARE","Responsable del Impuesto a las Ventas",5.0000000000000001E-3,5,null,null,"ANOLAIMA"]
{"$rows_left_out":994}
{"sheet":"BASES CUENTA","index":3,"n_rows":390,"n_cols":11,"rows_kept":390,"cut":false,"hidden":true,"merged":[]}
["Seleccionar",null,"Seleccionar",null,"Seleccionar",null,"Seleccionar",null,"Seleccionar",null,"Seleccionar"]
["Ahorros",null,"BANCO AGRARIO DE COLOMBIA S.A.",null,"ENERO",null,"YOLANDA REINOSA TANGARIFE",null,"ADRIANA CONSTANZA PINTO BARON ( E )",null,"SUBDIRECCION DE PARTICIPACION"]
["Corriente",null,"BANCO CAJA SOCIAL  BCSC  S A",null,"FEBRERO ",null,null,null,"AIDA SOLANO ESPINOSA",null,"GRUPO DE ENFOQUE PSICOSOCIAL"]
[null,null,"BANCO COLPATRIA RED MULTIBANCA COLPATRIA S.A.",null,"MARZO",null,null,null,"ALFREDO ENRIQUE PALENCIA MOLINA",null,"DIRECCION TERRITORIAL ATLANTICO"]
[null,null,"BANCO COMERCIAL AV VILLAS S.A.",null,"ABRIL",null,null,null,"ALICIA MARIA ROJAS PÉREZ",null,"DIRECCION TERRITORIAL NORTE DE SANTANDER Y ARAUCA"]
["Seleccionar",null,"BANCO DAVIVIENDA S.A.",null,"MAYO",null,null,null,"AMPARO CHICUE CRISTANCHO",null,"DIRECCION TERRITORIAL MAGDALENA MEDIO"]
["SI",null,"BANCO DE BOGOTA S. A.",null,"JUNIO",null,null,null,"ANA MARIA TORRES SANZ ( E )",null,"GRUPO DE ENFOQUE DIFERENCIAL Y DE GENERO"]
["NO",null,"BANCO DE OCCIDENTE",null,"JULIO",null,null,null,"BEATRIZ CARMENZA OCHOA OSORIO",null,"SUBDIRECCION DE ASISTENCIA Y ATENCION HUMANITARIA"]
[null,null,"BANCO GNB SUDAMERIS S A",null,"AGOSTO",null,null,null,"BEATRIZ CARMENZA OCHOA OSORIO (E)",null,"SUBDIRECCION DE PREVENCION Y EMERGENCIAS"]
[null,null,"BANCO PICHINCHA",null,"SEPTIEMBRE",null,null,null,"CARLOS ALFREDO VARGAS",null,"GRUPO DE CONTROL INTERNO DISCIPLINARIO - SECRETARIA GENERAL"]
["Seleccionar",null,"BANCO POPULAR S. A.",null,"OCTUBRE",null,null,null,"CARLOS ARTURO ORDOÑEZ CASTRO",null,"OFICINA DE CONTROL INTERNO"]
[1,null,"BANCOLOMBIA S.A.",null,"NOVIEMBRE",null,null,null,"CARLOS ARTURO PARDO ALEZONES",null,"DIRECCION TERRITORIAL META Y LLANOS ORIENTALES"]
[2,null,"BANCOOMEVA ",null,"DICIEMBRE",null,null,null,"CARMENZA CAROLINA COTES ROBAYO",null,"GRUPO DE GESTION DE LA OFERTA"]
[3,null,"BBVA - BANCO BILBAO VIZCAYA ARGENTARIA COLOMBIA S.A.",null,null,null,null,null,"CAROLINA MARIA MONCADA ZAPATA",null,"SECRETARIA GENERAL"]
[4,null,"CITIBANK COLOMBIA",null,null,null,null,null,"CLAUDIA VIVIANA FERRO BUITRAGO",null,"SUBDIRECCION GENERAL"]
[5,null,"CONFIAR COOPERATIVA FINANCIERA",null,null,null,null,null,"CLAUDIA VIVIANA FERRO BUITRAGO ( E )",null,"DIRECCION DE ASUNTOS ETNICOS"]
[6,null,"HELM BANK S.A.",null,null,null,null,null,"DAN HARRY SÁNCHEZ COBO",null,"DIRECCION TERRITORIAL CAUCA"]
[7,null,"HSBC COLOMBIA S A",null,null,null,null,null,"DIANA CAROLINA GARRIDO LOZANO",null,"GRUPO REPARACION Y ATENCION DE LAS COMUNIDADES NEGRAS, AFROCOLOMBIANAS, RAIZALES Y PALENQUERAS"]
[8,null,"ITAU CORPBANCA COLOMBIA S A",null,null,null,null,null,"DIRECTORES TERRITORIALES",null,"DIRECCIONES TERRITORIALES"]
[9,null,"JURISCOOP  SA   FINANCIERA COMPAÑIA DE FINANCIAMIENTO",null,null,null,null,null,"EDGAR HERNANDO PINZÓN PÁEZ",null,"GRUPO DE GESTION DEL TALENTO HUMANO - SECRETARIA GENERAL"]
[10,null,null,null,null,null,null,null,"GERMAN RAMIRO NARVÁEZ BURBANO",null,"DIRECCION TERRITORIAL PUTUMAYO"]
[11,null,"Seleccionar",null,null,null,null,null,"GINNA MARIATORRES NIETO",null,"GRUPO DE ACTUACIONES ADMINISTRATIVAS Y CONCEPTOS - OFICINA ASESORA JURIDICA"]
[12,null,"Responsable del Impuesto a las Ventas",null,null,null,null,null,"GLADYS CONSUELO BARRERA PARRADO",null,"SUBDIRECCION DE VALORACION Y REGISTRO"]
[null,null,"No responsable del impuesto a las ventas",null,null,null,null,null,"GONZALO GARCIA BAUTISTA",null,"DIRECCION TERRITORIAL SANTANDER"]
["Seleccionar",null,null,null,"Seleccionar",null,null,null,"ISAAC HERNANDEZ HERNANDEZ",null,"DIRECCION TERRITORIAL SUCRE"]
["2019-01-01",null,"Seleccionar",null,1,null,null,null,"JAIR DAVID DIAZ GRANADOS CORREDOR",null,"DIRECCION TERRITORIAL MAGDALENA"]
["2019-01-02",null,"Contratista",null,2,null,null,null,"JANETH ANGELICA SOLANO HERNANDEZ",null,"GRUPO DE GESTION CONTRACTUAL - SECRETARIA GENERAL"]
["2019-01-03",null,null,null,3,null,null,null,"JOHN VLADIMIR MARTIN RAMOS",null,"OFICINA ASESORA JURIDICA"]
["2019-01-04",null,null,null,4,null,null,null,"JOHN VLADIMIR MARTIN RAMOS (E)",null,"DIRECCION DE REPARACION"]
["2019-01-05",null,null,null,5,null,null,null,"JOSE DOMINGO CARDENAS PINTO",null,"GRUPO PUEBLOS Y COMUNIDADES INDIGENAS"]
["2019-01-06",null,null,null,6,null,null,null,"JUAN FELIPE ACOSTA PARRA ( E )",null,"DIRECCION TERRITORIAL CENTRAL"]
["2019-01-07",null,null,null,7,null,null,null,"JUAN FELIPE ACOSTA PARRA ( E )",null,"DIRECCION TERRITORIAL CORDOBA"]
["2019-01-08",null,null,null,8,null,null,null,"JUANA BAUTISTA RAMIREZ GUTIERREZ",null,"DIRECCION TERRITORIAL CESAR Y GUAJIRA"]
["2019-01-09",null,null,null,9,null,null,null,"JUANITA IBAÑEZ SANTAMARIA",null,"SUBDIRECCION DE REPARACION COLECTIVA"]
["2019-01-10",null,null,null,10,null,null,null,"JUANITA IBAÑEZ SANTAMARIA ( E )",null,"DIRECCION DE GESTION INTERINSTITUCIONAL"]
["2019-01-11",null,null,null,11,null,null,null,"KATHERINE LOREN MESA MAYORGA",null,"FONDO DE REPARACION"]
["2019-01-12",null,null,null,12,null,null,null,"KATHERINE LOREN MESA MAYORGA (E)",null,"SUBDIRECCION DE REPARACION INDIVIDUAL"]
["2019-01-13",null,null,null,13,null,null,null,"LAURA KATHERINE MORENO MEJIA",null,"DIRECCION TERRITORIAL EJE CAFETERO"]
["2019-01-14",null,null,null,14,null,null,null,"LIZA NINELLY BOTELLO PAYARES",null,"GRUPO DE GESTION FINANCIERA  - SECRETARIA GENERAL"]
["2019-01-15",null,null,null,15,null,null,null,"LOLY CATALINA VAN LEENDEN DEL RIO",null,"GRUPO DE SERVICIO AL CIUDADANO"]
{"$rows_left_out":351}
{"sheet":"Control de Cambios","index":4,"n_rows":5,"n_cols":3,"rows_kept":5,"cut":false,"hidden":true,"merged":[[0,0,1,0],[0,1,1,1],[0,2,1,2]]}
["Versión","Fecha de Cambio","Descripción de la modificación"]
[]
[1,"22 de Marzo de 2019","Creaciòn documento para pago de Contratos por concepto de honorarios y/o Prestaciòn de Servicios Personales"]
[]
["Nota: Se debe registrar el control de cambios,pero esta hoja no se publica."]